Target
Mu-type opioid receptor
Ligand
BDBM438997
Substrate
Meas. Tech.
Competitive Displacement Assay
Ki
<1±n/a nM
Citation
 Wynn, TAAlvarez, JCMoustakas, DTHaeberlein, MPennington, LD Compounds for the treatment of pain US Patent  US10604489 Publication Date 3/31/2020 
Target
Name:
Mu-type opioid receptor
Synonyms:
M-OR-1 MOR-1 MUOR1 Mu opiate receptor OPRM1 hMOP | mu-type opioid receptor isoform MOR-1
Type:
G Protein-Coupled Receptor (GPCR)
Mol. Mass.:
44789.51
Organism:
Homo sapiens (Human)
Description:
P35372
Residue:
400
  
Inhibitor
Name:
BDBM438997
Synonyms:
US10604489, Compound 176 | US11180455, Compound 176
Type:
Small organic molecule
Emp. Form.:
C22H30N2O3
Mol. Mass.:
370.4852
SMILES:
COC1(C2CCCC1CN(C[C@H]1[C@@H]3COC[C@H]13)C2)c1cccc(c1)C(N)=O
: