Target
Calmodulin-domain protein kinase 1
Ligand
BDBM416537
Substrate
Meas. Tech.
Enzymatic Inhibition Assay
IC50
1.60±n/a nM
Citation
 Hol, WGLarson, ETMaly, DJVan Voorhis, WCMerritt, EOjo, KK Compositions and methods for treating toxoplasmosis, cryptosporidiosis and other apicomplexan protozoan related diseases US Patent  US10632122 Publication Date 4/28/2020 
Target
Name:
Calmodulin-domain protein kinase 1
Synonyms:
Calmodulin-domain protein kinase 1 Calmodulin-domain protein kinase, putative
Type:
Enzyme Catalytic Domain
Mol. Mass.:
57248.42
Organism:
Toxoplasma gondii
Description:
Residue:
507
  
Inhibitor
Name:
BDBM416537
Synonyms:
US10307425, Example 3 | US10632122, Example 3
Type:
Small organic molecule
Emp. Form.:
C24H29N7O
Mol. Mass.:
431.5334
SMILES:
CN1CCC(CC2(N)N=CN=C3NNC(=C23)c2ccc3nc(OC4CC4)ccc3c2)CC1
: