Target
Calmodulin-domain protein kinase 1
Ligand
BDBM416554
Substrate
Meas. Tech.
Enzymatic Inhibition Assay
IC50
1.80±n/a nM
Citation
 Hol, WGLarson, ETMaly, DJVan Voorhis, WCMerritt, EOjo, KK Compositions and methods for treating toxoplasmosis, cryptosporidiosis and other apicomplexan protozoan related diseases US Patent  US10632122 Publication Date 4/28/2020 
Target
Name:
Calmodulin-domain protein kinase 1
Synonyms:
Calmodulin-domain protein kinase 1 Calmodulin-domain protein kinase, putative
Type:
Enzyme Catalytic Domain
Mol. Mass.:
57248.42
Organism:
Toxoplasma gondii
Description:
Residue:
507
  
Inhibitor
Name:
BDBM416554
Synonyms:
US10307425, Example 20 | US10632122, Example 20
Type:
Small organic molecule
Emp. Form.:
C22H22N6O2
Mol. Mass.:
402.4491
SMILES:
CC1(Cn2nc(-c3ccc4nc(OC5CC5)ccc4c3)c3c(N)ncnc23)COC1
: