Target
Calmodulin-domain protein kinase 1
Ligand
BDBM416565
Substrate
Meas. Tech.
Enzymatic Inhibition Assay
IC50
1.20±n/a nM
Citation
 Hol, WGLarson, ETMaly, DJVan Voorhis, WCMerritt, EOjo, KK Compositions and methods for treating toxoplasmosis, cryptosporidiosis and other apicomplexan protozoan related diseases US Patent  US10632122 Publication Date 4/28/2020 
Target
Name:
Calmodulin-domain protein kinase 1
Synonyms:
Calmodulin-domain protein kinase 1 Calmodulin-domain protein kinase, putative
Type:
Enzyme Catalytic Domain
Mol. Mass.:
57248.42
Organism:
Toxoplasma gondii
Description:
Residue:
507
  
Inhibitor
Name:
BDBM416565
Synonyms:
3-(4-amino-3-(6-ethoxynaphthalen-2-yl)-1H-pyrazolo[3,4-d]pyrimidin-1-yl)-2,2-dimethylpropan-1-ol US10632122, Example 32
Type:
Small organic molecule
Emp. Form.:
C22H25N5O2
Mol. Mass.:
391.4662
SMILES:
CCOc1ccc2cc(ccc2c1)-c1nn(CC(C)(C)CO)c2ncnc(N)c12
: