Target
Calmodulin-domain protein kinase 1
Ligand
BDBM416619
Substrate
Meas. Tech.
Enzymatic Inhibition Assay
IC50
1.50±n/a nM
Citation
 Hol, WGLarson, ETMaly, DJVan Voorhis, WCMerritt, EOjo, KK Compositions and methods for treating toxoplasmosis, cryptosporidiosis and other apicomplexan protozoan related diseases US Patent  US10632122 Publication Date 4/28/2020 
Target
Name:
Calmodulin-domain protein kinase 1
Synonyms:
Calmodulin-domain protein kinase 1 Calmodulin-domain protein kinase, putative
Type:
Enzyme Catalytic Domain
Mol. Mass.:
57248.42
Organism:
Toxoplasma gondii
Description:
Residue:
507
  
Inhibitor
Name:
BDBM416619
Synonyms:
4-((4-amino-3-(2-ethoxyquinolin-6-yl)-1H-pyrazolo[3,4-d]pyrimidin-1-yl)methyl)piperidine-4-carbonitrile US10632122, Example 86
Type:
Small organic molecule
Emp. Form.:
C23H24N8O
Mol. Mass.:
428.4897
SMILES:
CCOc1ccc2cc(ccc2n1)-c1nn(CC2(CCNCC2)C#N)c2ncnc(N)c12
: