Target
Isocitrate dehydrogenase [NADP] cytoplasmic [R132H]
Ligand
BDBM363584
Substrate
Meas. Tech.
In Vitro Assays
IC50
<100±n/a nM
Citation
 Popovici-Muller, JLemieux, RMTravins, JCai, ZCui, DZhou, D Therapeutically active compositions and their methods of use US Patent  US10640534 Publication Date 5/5/2020 
Target
Name:
Isocitrate dehydrogenase [NADP] cytoplasmic [R132H]
Synonyms:
Cytosolic NADP-isocitrate dehydrogenase (IDH1)(R132H) IDH1 R132H IDHC_HUMAN Isocitrate dehydrogenase 1 mutant (R132H) Isocitrate dehydrogenase [NADP] cytoplasmic (IDH1)(R132H) PICD
Type:
Protein
Mol. Mass.:
46641.74
Organism:
Homo sapiens (Human)
Description:
Human IDH1 R132H (SEQ ID No. 2 in patent). First three are removed. Google patent parsed wrong.
Residue:
414
  
Inhibitor
Name:
BDBM363584
Synonyms:
US10640534, Compound 76 US10717764, Compound 76 US11667673, Compound 76 | US9850277, Compound 76
Type:
Small organic molecule
Emp. Form.:
C28H25ClF3N5O4
Mol. Mass.:
587.977
SMILES:
Fc1cccc(c1)N([C@H](C(=O)NC1CCC(F)(F)CC1)c1ccccc1Cl)C(=O)[C@@H]1COC(=O)N1c1ncccn1
: