Target
C-X-C chemokine receptor type 1
Ligand
BDBM441948
Substrate
Meas. Tech.
In Vitro Affinity Assay
IC50
<20±n/a nM
Citation
 Musicki, BBhurruth-Alcor, Y Chemokine CXCR1 and CXCR2 receptor antagonist compounds, and use thereof in the treatment of chemokine-mediated pathologies US Patent  US10647706 Publication Date 5/12/2020 
Target
Name:
C-X-C chemokine receptor type 1
Synonyms:
C-X-C chemokine receptor type 1 (CXCR-1) CMKAR1 CXCR1_HUMAN Interleukin-8 receptor A | Interleukin-8 receptors, CXCR1/CXCR2
Type:
Enzyme
Mol. Mass.:
39803.83
Organism:
Homo sapiens (Human)
Description:
P25024
Residue:
350
  
Inhibitor
Name:
BDBM441948
Synonyms:
US10647706, Example 1
Type:
Small organic molecule
Emp. Form.:
C19H21N3O5S
Mol. Mass.:
403.452
SMILES:
CC[C@@H](Nc1c(Nc2cccc(c2O)S(C)(=N)=O)c(=O)c1=O)c1ccc(C)o1
: