Target
C-X-C chemokine receptor type 1
Ligand
BDBM385540
Substrate
Meas. Tech.
In Vitro Affinity Assay
IC50
<20±n/a nM
Citation
 Musicki, BBhurruth-Alcor, Y Chemokine CXCR1 and CXCR2 receptor antagonist compounds, and use thereof in the treatment of chemokine-mediated pathologies US Patent  US10647706 Publication Date 5/12/2020 
Target
Name:
C-X-C chemokine receptor type 1
Synonyms:
C-X-C chemokine receptor type 1 (CXCR-1) CMKAR1 CXCR1_HUMAN Interleukin-8 receptor A | Interleukin-8 receptors, CXCR1/CXCR2
Type:
Enzyme
Mol. Mass.:
39803.83
Organism:
Homo sapiens (Human)
Description:
P25024
Residue:
350
  
Inhibitor
Name:
BDBM385540
Synonyms:
3-{4-Chloro-2-hydroxy-3-methane[(N-methyl)sulfoximino]phenylamino}-4-[(R)-1-(5-methylfuran-2-yl)propylamino]cyclobut-3-ene-1,2-dione US10287278, Example 20B: | US10647706, Example 20
Type:
Small organic molecule
Emp. Form.:
C20H22ClN3O5S
Mol. Mass.:
451.924
SMILES:
CC[C@@H](Nc1c(Nc2ccc(Cl)c(c2O)S(C)(=O)=NC)c(=O)c1=O)c1ccc(C)o1
: