Target
Monoacylglycerol lipase ABHD6
Ligand
BDBM444445
Substrate
Meas. Tech.
Fluorescent Assay
IC50
55±n/a nM
Citation
 Makriyannis, AMalamas, MLamani, MFarah, SI ABHD6 and dual ABHD6/MGL inhibitors and their uses US Patent  US10662159 Publication Date 5/26/2020 
Target
Name:
Monoacylglycerol lipase ABHD6
Synonyms:
2-arachidonoylglycerol hydrolase ABHD6_HUMAN Monoacylglycerol lipase ABHD6
Type:
PROTEIN
Mol. Mass.:
38341.83
Organism:
Homo sapiens (Human)
Description:
ChEMBL_105457
Residue:
337
  
Inhibitor
Name:
BDBM444445
Synonyms:
US10662159, Example 30
Type:
Small organic molecule
Emp. Form.:
C16H16F6N2O2
Mol. Mass.:
382.3009
SMILES:
FC(F)(F)C(OC(=O)N1Cc2ccc(cc2C1)N1CCCC1)C(F)(F)F
: