Target
Monoglyceride lipase
Ligand
BDBM444458
Substrate
Meas. Tech.
Fluorescent Assay
IC50
55±n/a nM
Citation
 Makriyannis, AMalamas, MLamani, MFarah, SI ABHD6 and dual ABHD6/MGL inhibitors and their uses US Patent  US10662159 Publication Date 5/26/2020 
Target
Name:
Monoglyceride lipase
Synonyms:
HU-K5 Lysophospholipase-like MGL MGLL_HUMAN
Type:
Hydrolase
Mol. Mass.:
33264.56
Organism:
Homo sapiens (Human)
Description:
Human recombinant MGL (Cayman Chemical, cat# 10008354).
Residue:
303
  
Inhibitor
Name:
BDBM444458
Synonyms:
US10662159, Example 46
Type:
Small organic molecule
Emp. Form.:
C16H18F6N2O3
Mol. Mass.:
400.3161
SMILES:
CN(C)CCOc1ccc2CN(Cc2c1)C(=O)OC(C(F)(F)F)C(F)(F)F
: