Target
Monoglyceride lipase
Ligand
BDBM444462
Substrate
Meas. Tech.
Fluorescent Assay
IC50
55±n/a nM
Citation
 Makriyannis, AMalamas, MLamani, MFarah, SI ABHD6 and dual ABHD6/MGL inhibitors and their uses US Patent  US10662159 Publication Date 5/26/2020 
Target
Name:
Monoglyceride lipase
Synonyms:
HU-K5 Lysophospholipase-like MGL MGLL_HUMAN
Type:
Hydrolase
Mol. Mass.:
33264.56
Organism:
Homo sapiens (Human)
Description:
Human recombinant MGL (Cayman Chemical, cat# 10008354).
Residue:
303
  
Inhibitor
Name:
BDBM444462
Synonyms:
US10662159, Example 50
Type:
Small organic molecule
Emp. Form.:
C18H18F6N2O5
Mol. Mass.:
456.3363
SMILES:
FC(F)(F)C(OC(=O)N1Cc2ccc(OCC(=O)N3CCOCC3)cc2C1)C(F)(F)F
: