Target
Monoacylglycerol lipase ABHD6
Ligand
BDBM444465
Substrate
Meas. Tech.
Fluorescent Assay
IC50
55±n/a nM
Citation
 Makriyannis, AMalamas, MLamani, MFarah, SI ABHD6 and dual ABHD6/MGL inhibitors and their uses US Patent  US10662159 Publication Date 5/26/2020 
Target
Name:
Monoacylglycerol lipase ABHD6
Synonyms:
2-arachidonoylglycerol hydrolase ABHD6_HUMAN Monoacylglycerol lipase ABHD6
Type:
PROTEIN
Mol. Mass.:
38341.83
Organism:
Homo sapiens (Human)
Description:
ChEMBL_105457
Residue:
337
  
Inhibitor
Name:
BDBM444465
Synonyms:
US10662159, Example 54
Type:
Small organic molecule
Emp. Form.:
C17H17F6NO4
Mol. Mass.:
413.3116
SMILES:
COc1cccc(OC2CC3(C2)CN(C3)C(=O)OC(C(F)(F)F)C(F)(F)F)c1
: