Target
Fatty-acid amide hydrolase 1
Ligand
BDBM444474
Substrate
Meas. Tech.
Fluorescent Assay
IC50
55±n/a nM
Citation
 Makriyannis, AMalamas, MLamani, MFarah, SI ABHD6 and dual ABHD6/MGL inhibitors and their uses US Patent  US10662159 Publication Date 5/26/2020 
Target
Name:
Fatty-acid amide hydrolase 1
Synonyms:
Anandamide amidohydrolase FAAH FAAH1_HUMAN Fatty-acid amide hydrolase (FAAH) Oleamide hydrolase 1
Type:
Protein
Mol. Mass.:
63071.19
Organism:
Homo sapiens (Human)
Description:
O00519
Residue:
579
  
Inhibitor
Name:
BDBM444474
Synonyms:
US10662159, Example 67 | US10662159, Example 68
Type:
Small organic molecule
Emp. Form.:
C24H21F8NO3
Mol. Mass.:
523.4157
SMILES:
Fc1ccc(cc1)C(OC1CC2(C1)CCN(C2)C(=O)OC(C(F)(F)F)C(F)(F)F)c1ccc(F)cc1
: