Target
Plasminogen [101-181]
Ligand
BDBM290286
Substrate
Meas. Tech.
Plasma-Based Clot Lysis Assay
IC50
13.0±n/a nM
Citation
 Haßfeld, JKinzel, TKöbberling, JCancho-Grande, YBeyer, KRöhrig, SKöllnberger, MSperzel, MBurkhardt, NSchlemmer, KStegmann, CSchuhmacher, JWerner, MEllermann, M (Aza)pyridopyrazolopyrimidinones and indazolopyrimidinones and their use US Patent  US10668071 Publication Date 6/2/2020 
Target
Name:
Plasminogen [101-181]
Synonyms:
PLG Plasminogen (aa 101-181)
Type:
Enzyme Catalytic Domain
Mol. Mass.:
9281.08
Organism:
Homo sapiens (Human)
Description:
P00747[101-181]
Residue:
81
  
Inhibitor
Name:
BDBM290286
Synonyms:
7-Bromo-4-(piperidin-4-yl)pyrido[4′,3′:3,4]pyrazolo[1,5-a]pyrimidin-2(1H)-one hydrochloride US10668071, Example 27
Type:
Small organic molecule
Emp. Form.:
C14H14BrN5O
Mol. Mass.:
348.198
SMILES:
Brc1cncc2c1nn1c(cc(=O)[nH]c21)C1CCNCC1
: