Target
Plasminogen [101-181]
Ligand
BDBM290307
Substrate
Meas. Tech.
Plasma-Based Clot Lysis Assay
IC50
14.0±n/a nM
Citation
 Haßfeld, JKinzel, TKöbberling, JCancho-Grande, YBeyer, KRöhrig, SKöllnberger, MSperzel, MBurkhardt, NSchlemmer, KStegmann, CSchuhmacher, JWerner, MEllermann, M (Aza)pyridopyrazolopyrimidinones and indazolopyrimidinones and their use US Patent  US10668071 Publication Date 6/2/2020 
Target
Name:
Plasminogen [101-181]
Synonyms:
PLG Plasminogen (aa 101-181)
Type:
Enzyme Catalytic Domain
Mol. Mass.:
9281.08
Organism:
Homo sapiens (Human)
Description:
P00747[101-181]
Residue:
81
  
Inhibitor
Name:
BDBM290307
Synonyms:
(−)-trans-10-Bromo-4-(2-methylpiperidin-4-yl)pyrimido[1,2-b]indazol-2(1H)-one hydrochloride US10668071, Example 50
Type:
Small organic molecule
Emp. Form.:
C16H17BrN4O
Mol. Mass.:
361.236
SMILES:
CC1CC(CCN1)c1cc(=O)[nH]c2c3c(Br)cccc3nn12
: