Target
Plasminogen [101-181]
Ligand
BDBM290292
Substrate
Meas. Tech.
Plasma-Based Clot Lysis Assay
IC50
10.00±n/a nM
Citation
 Haßfeld, JKinzel, TKöbberling, JCancho-Grande, YBeyer, KRöhrig, SKöllnberger, MSperzel, MBurkhardt, NSchlemmer, KStegmann, CSchuhmacher, JWerner, MEllermann, M (Aza)pyridopyrazolopyrimidinones and indazolopyrimidinones and their use US Patent  US10668071 Publication Date 6/2/2020 
Target
Name:
Plasminogen [101-181]
Synonyms:
PLG Plasminogen (aa 101-181)
Type:
Enzyme Catalytic Domain
Mol. Mass.:
9281.08
Organism:
Homo sapiens (Human)
Description:
P00747[101-181]
Residue:
81
  
Inhibitor
Name:
BDBM290292
Synonyms:
2-Oxo-4-(piperidin-4-yl)-1,2-dihydropyrimido[1,2-b]indazole-10-carbonitrile trifluoroacetate US10098883, Example 53 | US10668071, Example 53
Type:
Small organic molecule
Emp. Form.:
C16H15N5O
Mol. Mass.:
293.3232
SMILES:
O=c1cc(C2CCNCC2)n2nc3cccc(C#N)c3c2[nH]1
: