Target
Plasminogen [101-181]
Ligand
BDBM290314
Substrate
Meas. Tech.
Plasma-Based Clot Lysis Assay
IC50
13.0±n/a nM
Citation
 Haßfeld, JKinzel, TKöbberling, JCancho-Grande, YBeyer, KRöhrig, SKöllnberger, MSperzel, MBurkhardt, NSchlemmer, KStegmann, CSchuhmacher, JWerner, MEllermann, M (Aza)pyridopyrazolopyrimidinones and indazolopyrimidinones and their use US Patent  US10668071 Publication Date 6/2/2020 
Target
Name:
Plasminogen [101-181]
Synonyms:
PLG Plasminogen (aa 101-181)
Type:
Enzyme Catalytic Domain
Mol. Mass.:
9281.08
Organism:
Homo sapiens (Human)
Description:
P00747[101-181]
Residue:
81
  
Inhibitor
Name:
BDBM290314
Synonyms:
10-(2-Fluorophenyl)-4-(piperidin-4-yl)pyrimido[1,2-b]indazol-2(1H)-one hydrochloride US10098883, Example 95 | US10668071, Example 95
Type:
Small organic molecule
Emp. Form.:
C21H19FN4O
Mol. Mass.:
362.4002
SMILES:
Fc1ccccc1-c1cccc2nn3c(cc(=O)[nH]c3c12)C1CCNCC1
: