Target
Sodium/potassium-transporting ATPase subunit alpha-1/beta-1
Ligand
BDBM444977
Substrate
Meas. Tech.
Selective Inhibition Assays of Isolated Na,K-ATPase
Ki
92.0±8.9 nM
Citation
 Karlish, SJKatz, ATal, DMMarcovich, A Selective inhibitors of Alpha2-containing isoforms of Na,K-ATPase and use thereof for reduction of intraocular pressure US Patent  US10668094 Publication Date 6/2/2020 
Target
Name:
Sodium/potassium-transporting ATPase subunit alpha-1/beta-1
Synonyms:
Na,K-ATPase α1β1 alpha1beta1FXYD1
Type:
Protein
Mol. Mass.:
Description:
Components:
This complex has 2 components.
Component 1
Name:
Sodium/potassium-transporting ATPase subunit alpha-1
Synonyms:
AT1A1_HUMAN Na(+)/K(+) ATPase alpha-1 subunit Sodium pump subunit alpha-1 | Sodium/potassium-transporting ATPase subunit alpha-1
Type:
Enzyme
Mol. Mass.:
112879.20
Organism:
Homo sapiens (Human)
Description:
P05023
Residue:
1023
  
Component 2
Name:
Sodium/potassium-transporting ATPase subunit beta-1
Synonyms:
AT1B1_HUMAN ATP1B1 | Na,K-ATPase isoform beta-1 (β1)
Type:
Enzyme
Mol. Mass.:
35067.44
Organism:
Homo sapiens (Human)
Description:
P05026
Residue:
303
  
Inhibitor
Name:
BDBM444977
Synonyms:
US10668094, Compound DiB
Type:
Small organic molecule
Emp. Form.:
C45H73NO12
Mol. Mass.:
820.0606
SMILES:
CCC(C)N1CCC(O[C@H]2[C@@H](O)C[C@H](O[C@H]3[C@@H](O)C[C@H](O[C@H]4CC[C@@]5(C)C(CCC6C5C[C@H](O)[C@]5(C)[C@H](CC[C@]65O)C5=CC(=O)OC5)C4)O[C@H]3C)O[C@H]2C)OC(C)C1
: