Target
Sodium/potassium-transporting ATPase subunit alpha-1/beta-1
Ligand
BDBM231662
Substrate
Meas. Tech.
Selective Inhibition Assays of Isolated Na,K-ATPase
Ki
119±15.0 nM
Citation
 Karlish, SJKatz, ATal, DMMarcovich, A Selective inhibitors of Alpha2-containing isoforms of Na,K-ATPase and use thereof for reduction of intraocular pressure US Patent  US10668094 Publication Date 6/2/2020 
Target
Name:
Sodium/potassium-transporting ATPase subunit alpha-1/beta-1
Synonyms:
Na,K-ATPase α1β1 alpha1beta1FXYD1
Type:
Protein
Mol. Mass.:
Description:
Components:
This complex has 2 components.
Component 1
Name:
Sodium/potassium-transporting ATPase subunit alpha-1
Synonyms:
AT1A1_HUMAN Na(+)/K(+) ATPase alpha-1 subunit Sodium pump subunit alpha-1 | Sodium/potassium-transporting ATPase subunit alpha-1
Type:
Enzyme
Mol. Mass.:
112879.20
Organism:
Homo sapiens (Human)
Description:
P05023
Residue:
1023
  
Component 2
Name:
Sodium/potassium-transporting ATPase subunit beta-1
Synonyms:
AT1B1_HUMAN ATP1B1 | Na,K-ATPase isoform beta-1 (β1)
Type:
Enzyme
Mol. Mass.:
35067.44
Organism:
Homo sapiens (Human)
Description:
P05026
Residue:
303
  
Inhibitor
Name:
BDBM231662
Synonyms:
DMeCF3 (13) | US10668094, Compound DCF3
Type:
Small organic molecule
Emp. Form.:
C43H66F3NO12
Mol. Mass.:
845.9788
SMILES:
C[C@@H]1O[C@H](C[C@H](O)[C@@H]1O[C@H]1C[C@H](O)[C@H](OC2CCN(CC(F)(F)F)CC(C)O2)[C@H](C)O1)O[C@H]1CC[C@@]2(C)C(CCC3C2C[C@H](O)[C@]2(C)[C@H](CC[C@]32O)C2=CC(=O)OC2)C1
: