Target
Sodium/potassium-transporting ATPase subunit alpha-1/beta-1
Ligand
BDBM46356
Substrate
Meas. Tech.
Selective Inhibition Assays of Isolated Na,K-ATPase
Ki
89.0±15.8 nM
Citation
 Karlish, SJKatz, ATal, DMMarcovich, A Selective inhibitors of Alpha2-containing isoforms of Na,K-ATPase and use thereof for reduction of intraocular pressure US Patent  US10668094 Publication Date 6/2/2020 
Target
Name:
Sodium/potassium-transporting ATPase subunit alpha-1/beta-1
Synonyms:
Na,K-ATPase α1β1 alpha1beta1FXYD1
Type:
Protein
Mol. Mass.:
Description:
Components:
This complex has 2 components.
Component 1
Name:
Sodium/potassium-transporting ATPase subunit alpha-1
Synonyms:
AT1A1_HUMAN Na(+)/K(+) ATPase alpha-1 subunit Sodium pump subunit alpha-1 | Sodium/potassium-transporting ATPase subunit alpha-1
Type:
Enzyme
Mol. Mass.:
112879.20
Organism:
Homo sapiens (Human)
Description:
P05023
Residue:
1023
  
Component 2
Name:
Sodium/potassium-transporting ATPase subunit beta-1
Synonyms:
AT1B1_HUMAN ATP1B1 | Na,K-ATPase isoform beta-1 (β1)
Type:
Enzyme
Mol. Mass.:
35067.44
Organism:
Homo sapiens (Human)
Description:
P05026
Residue:
303
  
Inhibitor
Name:
BDBM46356
Synonyms:
DIGITOXIN SMR000058529 cid_441207
Type:
Small organic molecule
Emp. Form.:
C41H64O13
Mol. Mass.:
764.9391
SMILES:
C[C@H]1O[C@H](C[C@H](O)[C@@H]1O)O[C@H]1[C@@H](O)C[C@H](O[C@H]2[C@@H](O)C[C@H](O[C@H]3CC[C@@]4(C)[C@H](CC[C@@H]5[C@@H]4CC[C@]4(C)[C@H](CC[C@]54O)C4=CC(=O)OC4)C3)O[C@@H]2C)O[C@@H]1C
: