Target
Isocitrate dehydrogenase [NADP] cytoplasmic [R132C]
Ligand
BDBM363511
Substrate
Meas. Tech.
In Vitro Assay
IC50
<100±n/a nM
Citation
 Lemieux, RMPopovici-Muller, JTravins, JCai, ZCui, DZhou, D Therapeutically active compounds and their methods of use US Patent  US10689414 Publication Date 6/23/2020 
Target
Name:
Isocitrate dehydrogenase [NADP] cytoplasmic [R132C]
Synonyms:
IDH1 IDH1(R132C) Isocitrate dehydrogenase (IDH1)(R132C) Isocitrate dehydrogenase [NADP] cytoplasmic (IDH1) (R132C) | PICD
Type:
Enzyme Catalytic Domain
Mol. Mass.:
46607.23
Organism:
Homo sapiens (Human)
Description:
O75874[R132C]
Residue:
414
  
Inhibitor
Name:
BDBM363511
Synonyms:
US10640534, Compound 4 US10717764, Compound 4 US9850277, Compound 4
Type:
Small organic molecule
Emp. Form.:
C29H27ClF3N5O3
Mol. Mass.:
586.005
SMILES:
Fc1cccc(c1)N([C@H](C(=O)NC1CCC(F)(F)CC1)c1ccccc1Cl)C(=O)C1CCC(=O)N1c1ncccn1
: