Target
ALK tyrosine kinase receptor [L1196M]
Ligand
BDBM448449
Substrate
Meas. Tech.
Inhibition Assay
IC50
<1±n/a nM
Citation
 Wang, XXu, YSheng, XZhang, XXia, HYang, ZYue, YHuang, LXiao, Q Pyrimidine derivative and use thereof US Patent  US10695347 Publication Date 6/30/2020 
Target
Name:
ALK tyrosine kinase receptor [L1196M]
Synonyms:
ALK ALK tyrosine kinase receptor (ALK) (L1196M) ALK tyrosine kinase receptor (L1196M) Anaplastic lymphoma kinase L1196M (ALK L1196M) | Tyrosine-protein kinase receptor [L1196M]
Type:
Mol. Mass.:
176471.13
Organism:
Homo sapiens (Human)
Description:
Q9UM73[L1196M]
Residue:
1620
  
Inhibitor
Name:
BDBM448449
Synonyms:
US10695347, Compound I-15
Type:
Small organic molecule
Emp. Form.:
C32H44ClN7O3S
Mol. Mass.:
642.255
SMILES:
COc1cc(ccc1Nc1ncc(Cl)c(Nc2ccccc2S(=O)(=O)C(C)C)n1)N1CCC(CC1)N1CCC(CC1)N(C)C
: