Target
ALK tyrosine kinase receptor [L1196M]
Ligand
BDBM448465
Substrate
Meas. Tech.
Inhibition Assay
IC50
<1±n/a nM
Citation
 Wang, XXu, YSheng, XZhang, XXia, HYang, ZYue, YHuang, LXiao, Q Pyrimidine derivative and use thereof US Patent  US10695347 Publication Date 6/30/2020 
Target
Name:
ALK tyrosine kinase receptor [L1196M]
Synonyms:
ALK ALK tyrosine kinase receptor (ALK) (L1196M) ALK tyrosine kinase receptor (L1196M) Anaplastic lymphoma kinase L1196M (ALK L1196M) | Tyrosine-protein kinase receptor [L1196M]
Type:
Mol. Mass.:
176471.13
Organism:
Homo sapiens (Human)
Description:
Q9UM73[L1196M]
Residue:
1620
  
Inhibitor
Name:
BDBM448465
Synonyms:
US10695347, Compound I-95
Type:
Small organic molecule
Emp. Form.:
C27H33ClF2N6O3S
Mol. Mass.:
595.104
SMILES:
CC(C)S(=O)(=O)c1ccccc1Nc1nc(Nc2ccc(cc2OC(F)F)N2CCC(CC2)N(C)C)ncc1Cl
: