Target
P2X purinoceptor 7
Ligand
BDBM254332
Substrate
Meas. Tech.
Radioligand Binding
Ki
3.10±n/a nM
Citation
 Alcazar Vaca, MJAndres Gil, JIChrovian, CCCoate, HRDe angelis, MDvorak, CAGelin, CFLetavic, MASavall, BMSoyode-Johnson, AStenne, BMSwanson, DM P2X7 modulators US Patent  US10703749 Publication Date 7/7/2020 
Target
Name:
P2X purinoceptor 7
Synonyms:
ATP receptor P2X purinoceptor 7 P2X purinoceptor 7 (P2X7) P2X7 rat P2rx7 | Purinergic receptor
Type:
Protein
Mol. Mass.:
68403.50
Organism:
Rattus norvegicus (Rat)
Description:
Q64663
Residue:
595
  
Inhibitor
Name:
BDBM254332
Synonyms:
US10112937, Example 235 US10703749, Example 235 | US9464084, 235
Type:
Small organic molecule
Emp. Form.:
C19H16ClF3N6O
Mol. Mass.:
436.818
SMILES:
C[C@H]1N(CCc2c1nnn2-c1nccc(C)n1)C(=O)c1cccc(c1Cl)C(F)(F)F
: