Target
P2X purinoceptor 7
Ligand
BDBM254381
Substrate
Meas. Tech.
Radioligand Binding
IC50
6.30±n/a nM
Citation
 Alcazar Vaca, MJAndres Gil, JIChrovian, CCCoate, HRDe angelis, MDvorak, CAGelin, CFLetavic, MASavall, BMSoyode-Johnson, AStenne, BMSwanson, DM P2X7 modulators US Patent  US10703749 Publication Date 7/7/2020 
Target
Name:
P2X purinoceptor 7
Synonyms:
ATP receptor P2X purinoceptor 7 P2X purinoceptor 7 (P2X7) P2X7 rat P2rx7 | Purinergic receptor
Type:
Protein
Mol. Mass.:
68403.50
Organism:
Rattus norvegicus (Rat)
Description:
Q64663
Residue:
595
  
Inhibitor
Name:
BDBM254381
Synonyms:
US10112937, Example 288 US10703749, Example 288 | US9464084, 288
Type:
Small organic molecule
Emp. Form.:
C20H16ClF3N4O
Mol. Mass.:
420.815
SMILES:
C[C@H]1Cc2c(CN1C(=O)c1cccc(c1Cl)C(F)(F)F)nnn2-c1ccccc1
: