Target
Toll-like receptor 7
Ligand
BDBM450016
Substrate
Meas. Tech.
Inhibition of the Activation Assay
IC50
13.0±n/a nM
Citation
 Tojo, SIsobe, YIdeue, EFujiwara, HUrabe, D Substituted purine derivative US Patent  US10703755 Publication Date 7/7/2020 
Target
Name:
Toll-like receptor 7
Synonyms:
ORF Names:UNQ248/PRO285 TLR7_HUMAN | Toll-like receptor 7 (TLR7)
Type:
Enzyme
Mol. Mass.:
120945.35
Organism:
Homo sapiens (Human)
Description:
Q9NYK1
Residue:
1049
  
Inhibitor
Name:
BDBM450016
Synonyms:
US10703755, Example 133
Type:
Small organic molecule
Emp. Form.:
C28H32FN7O
Mol. Mass.:
501.5984
SMILES:
CCCN1C[C@@H]2C[C@H]1CN2Cc1ccc(Cn2c(nc3c(C)nc(OC)nc23)-c2cncc(F)c2)cc1
: