Target
Toll-like receptor 7
Ligand
BDBM450031
Substrate
Meas. Tech.
Inhibition of the Activation Assay
IC50
16.0±n/a nM
Citation
 Tojo, SIsobe, YIdeue, EFujiwara, HUrabe, D Substituted purine derivative US Patent  US10703755 Publication Date 7/7/2020 
Target
Name:
Toll-like receptor 7
Synonyms:
ORF Names:UNQ248/PRO285 TLR7_HUMAN | Toll-like receptor 7 (TLR7)
Type:
Enzyme
Mol. Mass.:
120945.35
Organism:
Homo sapiens (Human)
Description:
Q9NYK1
Residue:
1049
  
Inhibitor
Name:
BDBM450031
Synonyms:
1-[4-(4-{[6-Amino-2-ethoxy-8-(5-fluoropyridin-3-yl)-9H-purin-9-yl]methyl}phenyl)piperidin-1-yl]-2-(dimethylamino)ethanone | US10703755, Example 148
Type:
Small organic molecule
Emp. Form.:
C28H33FN8O2
Mol. Mass.:
532.6124
SMILES:
CCOc1nc(N)c2nc(-c3cncc(F)c3)n(Cc3ccc(cc3)C3CCN(CC3)C(=O)CN(C)C)c2n1
: