Target
Toll-like receptor 7
Ligand
BDBM450060
Substrate
Meas. Tech.
Inhibition of the Activation Assay
IC50
10.00±n/a nM
Citation
 Tojo, SIsobe, YIdeue, EFujiwara, HUrabe, D Substituted purine derivative US Patent  US10703755 Publication Date 7/7/2020 
Target
Name:
Toll-like receptor 7
Synonyms:
ORF Names:UNQ248/PRO285 TLR7_HUMAN | Toll-like receptor 7 (TLR7)
Type:
Enzyme
Mol. Mass.:
120945.35
Organism:
Homo sapiens (Human)
Description:
Q9NYK1
Residue:
1049
  
Inhibitor
Name:
BDBM450060
Synonyms:
9-{4-[(3R)-1-Azabicyclo[2.2.2]oct-3-yl]benzyl}-8-(5-fluoropyridin-3-yl)-2-methoxy-6-methyl-9H-purine; 9-{4-[(3S)-1-azabicyclo[2.2.2]oct-3-yl]benzyl}-8-(5-fluoropyridin-3-yl)-2-methoxy-6-methyl-9H-purine US10703755, Example 178
Type:
Small organic molecule
Emp. Form.:
C26H27FN6O
Mol. Mass.:
458.5306
SMILES:
COc1nc(C)c2nc(-c3cncc(F)c3)n(Cc3ccc(cc3)[C@H]3CN4CCC3CC4)c2n1
: