Target
Toll-like receptor 7
Ligand
BDBM450080
Substrate
Meas. Tech.
Inhibition of the Activation Assay
IC50
18.0±n/a nM
Citation
 Tojo, SIsobe, YIdeue, EFujiwara, HUrabe, D Substituted purine derivative US Patent  US10703755 Publication Date 7/7/2020 
Target
Name:
Toll-like receptor 7
Synonyms:
ORF Names:UNQ248/PRO285 TLR7_HUMAN | Toll-like receptor 7 (TLR7)
Type:
Enzyme
Mol. Mass.:
120945.35
Organism:
Homo sapiens (Human)
Description:
Q9NYK1
Residue:
1049
  
Inhibitor
Name:
BDBM450080
Synonyms:
US10703755, Example 260
Type:
Small organic molecule
Emp. Form.:
C23H22F2N6O
Mol. Mass.:
436.4572
SMILES:
COc1nc(C)c2nc(-c3cncc(F)c3)n(Cc3ccc(CN4CCC4)cc3F)c2n1
: