Target
Toll-like receptor 7
Ligand
BDBM450121
Substrate
Meas. Tech.
Inhibition of the Activation Assay
IC50
4.00±n/a nM
Citation
 Tojo, SIsobe, YIdeue, EFujiwara, HUrabe, D Substituted purine derivative US Patent  US10703755 Publication Date 7/7/2020 
Target
Name:
Toll-like receptor 7
Synonyms:
ORF Names:UNQ248/PRO285 TLR7_HUMAN | Toll-like receptor 7 (TLR7)
Type:
Enzyme
Mol. Mass.:
120945.35
Organism:
Homo sapiens (Human)
Description:
Q9NYK1
Residue:
1049
  
Inhibitor
Name:
BDBM450121
Synonyms:
US10703755, Example 304
Type:
Small organic molecule
Emp. Form.:
C27H29FN6O
Mol. Mass.:
472.5572
SMILES:
COc1nc(C)c2nc(-c3cnccc3C)n(Cc3ccc(cc3F)C3CN4CCC3CC4)c2n1
: