Target
Toll-like receptor 7
Ligand
BDBM450128
Substrate
Meas. Tech.
Inhibition of the Activation Assay
IC50
11.0±n/a nM
Citation
 Tojo, SIsobe, YIdeue, EFujiwara, HUrabe, D Substituted purine derivative US Patent  US10703755 Publication Date 7/7/2020 
Target
Name:
Toll-like receptor 7
Synonyms:
ORF Names:UNQ248/PRO285 TLR7_HUMAN | Toll-like receptor 7 (TLR7)
Type:
Enzyme
Mol. Mass.:
120945.35
Organism:
Homo sapiens (Human)
Description:
Q9NYK1
Residue:
1049
  
Inhibitor
Name:
BDBM450128
Synonyms:
US10703755, Example 311
Type:
Small organic molecule
Emp. Form.:
C28H29FN8O
Mol. Mass.:
512.5813
SMILES:
CCOc1nc(C)c2nc(-c3cncc(c3)C#N)n(Cc3ccc(CN4CC5CC4CN5C)cc3F)c2n1
: