Target
Toll-like receptor 7
Ligand
BDBM450162
Substrate
Meas. Tech.
Inhibition of the Activation Assay
IC50
18.0±n/a nM
Citation
 Tojo, SIsobe, YIdeue, EFujiwara, HUrabe, D Substituted purine derivative US Patent  US10703755 Publication Date 7/7/2020 
Target
Name:
Toll-like receptor 7
Synonyms:
ORF Names:UNQ248/PRO285 TLR7_HUMAN | Toll-like receptor 7 (TLR7)
Type:
Enzyme
Mol. Mass.:
120945.35
Organism:
Homo sapiens (Human)
Description:
Q9NYK1
Residue:
1049
  
Inhibitor
Name:
BDBM450162
Synonyms:
US10703755, Example 358
Type:
Small organic molecule
Emp. Form.:
C25H22F2N6O
Mol. Mass.:
460.4786
SMILES:
Cc1nc(O)nc2n(Cc3ccc(C4=CN5CCC4CC5)c(F)c3)c(nc12)-c1cncc(F)c1
: