Target
Toll-like receptor 7
Ligand
BDBM450179
Substrate
Meas. Tech.
Inhibition of the Activation Assay
IC50
7.00±n/a nM
Citation
 Tojo, SIsobe, YIdeue, EFujiwara, HUrabe, D Substituted purine derivative US Patent  US10703755 Publication Date 7/7/2020 
Target
Name:
Toll-like receptor 7
Synonyms:
ORF Names:UNQ248/PRO285 TLR7_HUMAN | Toll-like receptor 7 (TLR7)
Type:
Enzyme
Mol. Mass.:
120945.35
Organism:
Homo sapiens (Human)
Description:
Q9NYK1
Residue:
1049
  
Inhibitor
Name:
BDBM450179
Synonyms:
US10703755, Example 377
Type:
Small organic molecule
Emp. Form.:
C26H26F2N6O
Mol. Mass.:
476.521
SMILES:
COc1nc(C)c2nc(-c3cncc(F)c3)n(Cc3ccc(C4CN5CCC4CC5)c(F)c3)c2n1
: