Target
Ectonucleotide pyrophosphatase/phosphodiesterase family member 2
Ligand
BDBM450575
Substrate
Meas. Tech.
Human ATX Enzyme Inhibition Assay
IC50
1.000±n/a nM
Citation
 Hert, JHunziker, DKuratli, CMartin, REMattei, PSatz, AL Bicyclic quinazolinone derivatives US Patent  US10676446 Publication Date 6/9/2020 
Target
Name:
Ectonucleotide pyrophosphatase/phosphodiesterase family member 2
Synonyms:
ATX Autotaxin (ATX) ENPP2 Ectonucleotide Pyrophosphatase/Phosphodiesterase 2 (ENPP2) Extracellular lysophospholipase D PDNP2
Type:
Enzyme
Mol. Mass.:
99007.13
Organism:
Homo sapiens (Human)
Description:
Q13822
Residue:
863
  
Inhibitor
Name:
BDBM450575
Synonyms:
N-[(3-Chloro-4- cyanophenyl)methyl]-N- methyl-2-(4-oxo-6- piperidin-4-ylquinazolin- 3-yl)acetamide (intermediate A-9) and (S)-2-methoxypropanoic acid ([CAS RN 23953- 00-6]) | US10676446, Example 159
Type:
Small organic molecule
Emp. Form.:
C28H30ClN5O4
Mol. Mass.:
536.022
SMILES:
CO[C@@H](C)C(=O)N1CCC(CC1)c1ccc2ncn(CC(=O)N(C)Cc3ccc(C#N)c(Cl)c3)c(=O)c2c1
: