Target
Ectonucleotide pyrophosphatase/phosphodiesterase family member 2
Ligand
BDBM450579
Substrate
Meas. Tech.
Human ATX Enzyme Inhibition Assay
IC50
1.000±n/a nM
Citation
 Hert, JHunziker, DKuratli, CMartin, REMattei, PSatz, AL Bicyclic quinazolinone derivatives US Patent  US10676446 Publication Date 6/9/2020 
Target
Name:
Ectonucleotide pyrophosphatase/phosphodiesterase family member 2
Synonyms:
ATX Autotaxin (ATX) ENPP2 Ectonucleotide Pyrophosphatase/Phosphodiesterase 2 (ENPP2) Extracellular lysophospholipase D PDNP2
Type:
Enzyme
Mol. Mass.:
99007.13
Organism:
Homo sapiens (Human)
Description:
Q13822
Residue:
863
  
Inhibitor
Name:
BDBM450579
Synonyms:
2-[6-(1-tert-Butoxycarbonyl-4- piperidyl)-4-oxoquinazolin-3- yl]acetic acid (intermediate A-8, step E) and (4-chloro-3- (trifluoromethyl)phenyl)methanamine ([CAS RN 62039-92-3]) | US10676446, Example 163
Type:
Small organic molecule
Emp. Form.:
C25H24ClF3N4O3
Mol. Mass.:
520.931
SMILES:
CC(=O)N1CCC(CC1)c1ccc2ncn(CC(=O)NCc3ccc(Cl)c(c3)C(F)(F)F)c(=O)c2c1
: