Target
Ectonucleotide pyrophosphatase/phosphodiesterase family member 2
Ligand
BDBM450605
Substrate
Meas. Tech.
Human ATX Enzyme Inhibition Assay
IC50
1.000±n/a nM
Citation
 Hert, JHunziker, DKuratli, CMartin, REMattei, PSatz, AL Bicyclic quinazolinone derivatives US Patent  US10676446 Publication Date 6/9/2020 
Target
Name:
Ectonucleotide pyrophosphatase/phosphodiesterase family member 2
Synonyms:
ATX Autotaxin (ATX) ENPP2 Ectonucleotide Pyrophosphatase/Phosphodiesterase 2 (ENPP2) Extracellular lysophospholipase D PDNP2
Type:
Enzyme
Mol. Mass.:
99007.13
Organism:
Homo sapiens (Human)
Description:
Q13822
Residue:
863
  
Inhibitor
Name:
BDBM450605
Synonyms:
2-[6-(1-Acetylpiperidin-4-yl)-4-oxopyrido[3,4-d]pyrimidin-3-yl]-N-[(3-chloro-4-cyanophenyl)methyl]-N-methylacetamide | US10676446, Example 189
Type:
Small organic molecule
Emp. Form.:
C25H25ClN6O3
Mol. Mass.:
492.957
SMILES:
CN(Cc1ccc(C#N)c(Cl)c1)C(=O)Cn1cnc2cnc(cc2c1=O)C1CCN(CC1)C(C)=O
: