Target
Receptor tyrosine-protein kinase erbB-2
Ligand
BDBM50180302
Substrate
Meas. Tech.
biochemical assay
IC50
100.0±10 nM
Citation
 Chiosis, GHe, HLlauger-Bufi, LKim, JLarson, SMSmith-Jones, P Small-molecule HSP90 inhibitors US Patent  US10676476 Publication Date 6/9/2020 
Target
Name:
Receptor tyrosine-protein kinase erbB-2
Synonyms:
2.7.10.1 CD_antigen=CD340 ERBB2_HUMAN FASN/HER2 HER2 MLN19 NEU Proto-oncogene Neu Tyrosine kinase-type cell surface receptor HER2 | p185erbB2
Type:
Mol. Mass.:
137894.47
Organism:
Homo sapiens (Human)
Description:
P04626
Residue:
1255
  
Inhibitor
Name:
BDBM50180302
Synonyms:
8-(6-iodo-benzo[1,3]dioxol-5-ylsulfanyl)-9-(3-isopropylamino-propyl)adenine 8-[(6-IODO-1,3-BENZODIOXOL-5-YL)THIO]-9-[3-(ISOPROPYLAMINO)PROPYL]-9H-PURIN-6-AMINE US10336757, Compound PU-H71 | US10676476, Example 9
Type:
Small organic molecule
Emp. Form.:
C18H21IN6O2S
Mol. Mass.:
512.368
SMILES:
CC(C)NCCCn1c(Sc2cc3OCOc3cc2I)nc2c(N)ncnc12
: