Target
Induced myeloid leukemia cell differentiation protein Mcl-1
Ligand
BDBM451128
Substrate
Meas. Tech.
Exemplary MCL-1 Inhibitors Bind MCL-1
Ki
0.036±n/a nM
Citation
 Judd, ASKunzer, ARLai, CSouers, AJTao, ZMastracchio, AWang, XJi, CWendt, MDSong, XDoherty, GAPenning, TD Macrocyclic MCL-1 inhibitors and methods of use US Patent  US10676485 Publication Date 6/9/2020 
Target
Name:
Induced myeloid leukemia cell differentiation protein Mcl-1
Synonyms:
BCL2L3 Bcl-2-like protein 3 (Mcl-1) Bcl2-L-3 MCL1 Mcl-1 Myeloid cell leukemia sequence 1 (BCL2-related) | mcl1/EAT
Type:
Membrane; Single-pass membrane protein
Mol. Mass.:
37332.87
Organism:
Homo sapiens (Human)
Description:
Q07820
Residue:
350
  
Inhibitor
Name:
BDBM451128
Synonyms:
US10676485, Example 38
Type:
Small organic molecule
Emp. Form.:
C53H59Cl2FN6O9S
Mol. Mass.:
1046.04
SMILES:
CN1CCN(C[C@@H]2COc3ccc(OCc4ccnc(n4)C4=CC[C@@](F)(COC[C@@H]5COCCO5)CC4)c(C[C@@H](Oc4ncnc5sc(C6=CCCC6)c(-c6c(C)c(Cl)c(O2)c(Cl)c6C)c45)C(O)=O)c3)CC1
: