Target
Serine/threonine-protein kinase 3
Ligand
BDBM451711
Substrate
Meas. Tech.
Biochemical Assay
IC50
120±n/a nM
Citation
 Gray, NSBuhrlage, SAnderson, KCottini, FTonon, G STK4 inhibitors for treatment of hematologic malignancies US Patent  US10710978 Publication Date 7/14/2020 
Target
Name:
Serine/threonine-protein kinase 3
Synonyms:
KRS1 MST2 STE20-Like Kinase MST2 STK3_HUMAN Serine/threonine-protein kinase 3 (MST2) Serine/threonine-protein kinase Krs-1 | Serine/threonine-protein kinase MST2
Type:
Serine/threonine-protein kinase
Mol. Mass.:
56284.87
Organism:
Homo sapiens (Human)
Description:
Residue:
491
  
Inhibitor
Name:
BDBM451711
Synonyms:
6-(2-amino-5-(2-fluoro-5- nitrophenyl)pyridin-3-yl)-3,4- dihydroisoquinolin-1(2H)-one | US10710978, Compound I-1
Type:
Small organic molecule
Emp. Form.:
C20H15FN4O3
Mol. Mass.:
378.3565
SMILES:
Nc1ncc(cc1-c1ccc2C(=O)NCCc2c1)-c1cc(ccc1F)[N+]([O-])=O
: