Target
Serine/threonine-protein kinase 4
Ligand
BDBM451721
Substrate
Meas. Tech.
Biochemical Assay
IC50
120±n/a nM
Citation
 Gray, NSBuhrlage, SAnderson, KCottini, FTonon, G STK4 inhibitors for treatment of hematologic malignancies US Patent  US10710978 Publication Date 7/14/2020 
Target
Name:
Serine/threonine-protein kinase 4
Synonyms:
KRS2 STK4 Serine/threonine-protein kinase 3/4 Serine/threonine-protein kinase MST1
Type:
Enzyme
Mol. Mass.:
55611.40
Organism:
Homo sapiens (Human)
Description:
Q13043
Residue:
487
  
Inhibitor
Name:
BDBM451721
Synonyms:
3-(6-amino-5-(1-oxo-1,2,3,4- tetrahydroisoquinolin-6- yl)pyridin-3-yl)-N- cyclopropylbenzenesulfonamide | US10710978, Compound I-12
Type:
Small organic molecule
Emp. Form.:
C23H22N4O3S
Mol. Mass.:
434.511
SMILES:
Nc1ncc(cc1-c1ccc2C(=O)NCCc2c1)-c1cccc(c1)S(=O)(=O)NC1CC1
: