Target
Serine/threonine-protein kinase 4
Ligand
BDBM451735
Substrate
Meas. Tech.
Biochemical Assay
IC50
120±n/a nM
Citation
 Gray, NSBuhrlage, SAnderson, KCottini, FTonon, G STK4 inhibitors for treatment of hematologic malignancies US Patent  US10710978 Publication Date 7/14/2020 
Target
Name:
Serine/threonine-protein kinase 4
Synonyms:
KRS2 STK4 Serine/threonine-protein kinase 3/4 Serine/threonine-protein kinase MST1
Type:
Enzyme
Mol. Mass.:
55611.40
Organism:
Homo sapiens (Human)
Description:
Q13043
Residue:
487
  
Inhibitor
Name:
BDBM451735
Synonyms:
6-(2-amino-5-(4-ethynyl-2- fluoro-5-nitrophenyl)pyridin- 3-yl)-3,4-dihydroisoquinolin- 1(2H)-one | US10710978, Compound I-45
Type:
Small organic molecule
Emp. Form.:
C22H15FN4O3
Mol. Mass.:
402.3779
SMILES:
Nc1ncc(cc1-c1ccc2C(=O)NCCc2c1)-c1cc(c(cc1F)C#C)[N+]([O-])=O
: