Target
Serine/threonine-protein kinase 4
Ligand
BDBM451760
Substrate
Meas. Tech.
Biochemical Assay
IC50
120±n/a nM
Citation
 Gray, NSBuhrlage, SAnderson, KCottini, FTonon, G STK4 inhibitors for treatment of hematologic malignancies US Patent  US10710978 Publication Date 7/14/2020 
Target
Name:
Serine/threonine-protein kinase 4
Synonyms:
KRS2 STK4 Serine/threonine-protein kinase 3/4 Serine/threonine-protein kinase MST1
Type:
Enzyme
Mol. Mass.:
55611.40
Organism:
Homo sapiens (Human)
Description:
Q13043
Residue:
487
  
Inhibitor
Name:
BDBM451760
Synonyms:
5-(2-amino-5-(4- fluorobenzo[d]thiazol-7- yl)pyridin-3-yI)isoindolin-1- one | US10710978, Compound I-70
Type:
Small organic molecule
Emp. Form.:
C20H13FN4OS
Mol. Mass.:
376.407
SMILES:
Nc1ncc(cc1-c1ccc2C(=O)NCc2c1)-c1ccc(F)c2ncsc12
: