Target
Serine/threonine-protein kinase 3
Ligand
BDBM451762
Substrate
Meas. Tech.
Biochemical Assay
IC50
120±n/a nM
Citation
 Gray, NSBuhrlage, SAnderson, KCottini, FTonon, G STK4 inhibitors for treatment of hematologic malignancies US Patent  US10710978 Publication Date 7/14/2020 
Target
Name:
Serine/threonine-protein kinase 3
Synonyms:
KRS1 MST2 STE20-Like Kinase MST2 STK3_HUMAN Serine/threonine-protein kinase 3 (MST2) Serine/threonine-protein kinase Krs-1 | Serine/threonine-protein kinase MST2
Type:
Serine/threonine-protein kinase
Mol. Mass.:
56284.87
Organism:
Homo sapiens (Human)
Description:
Residue:
491
  
Inhibitor
Name:
BDBM451762
Synonyms:
3-(6-amino-5-(1-oxo-1,2,3,4- tetrahydroisoquinolin-6- yl)pyridin-3-yl)benzonitrile | US10710978, Compound I-75
Type:
Small organic molecule
Emp. Form.:
C21H16N4O
Mol. Mass.:
340.3779
SMILES:
Nc1ncc(cc1-c1ccc2C(=O)NCCc2c1)-c1cccc(c1)C#N
: