Target
Lys-gingipain W83
Ligand
BDBM453362
Substrate
Meas. Tech.
Inhibition of Lysine Gingipain
IC50
0.100±n/a nM
Citation
 Konradi, AWGalemmo, Jr., RADominy, SSLynch, CCHolsinger, LJ Ketone inhibitors of lysine gingipain US Patent  US10730826 Publication Date 8/4/2020 
Target
Name:
Lys-gingipain W83
Synonyms:
KGP83_PORGN Lysine specific cysteine protease Porphypain kgp prtP
Type:
Mol. Mass.:
187834.89
Organism:
Porphyromonas gingivalis
Description:
Q51817
Residue:
1732
  
Inhibitor
Name:
BDBM453362
Synonyms:
BDBM553865 | US10730826, Compound 56a
Type:
Small organic molecule
Emp. Form.:
C16H19FN4O4
Mol. Mass.:
350.3449
SMILES:
NCCCCC(NC(=O)c1cccnc1F)C(=O)COc1ccon1
: