Target
Lys-gingipain W83
Ligand
BDBM453370
Substrate
Meas. Tech.
Inhibition of Lysine Gingipain
IC50
0.400±n/a nM
Citation
 Konradi, AWGalemmo, Jr., RADominy, SSLynch, CCHolsinger, LJ Ketone inhibitors of lysine gingipain US Patent  US10730826 Publication Date 8/4/2020 
Target
Name:
Lys-gingipain W83
Synonyms:
KGP83_PORGN Lysine specific cysteine protease Porphypain kgp prtP
Type:
Mol. Mass.:
187834.89
Organism:
Porphyromonas gingivalis
Description:
Q51817
Residue:
1732
  
Inhibitor
Name:
BDBM453370
Synonyms:
BDBM553872 | US10730826, Compound 64a
Type:
Small organic molecule
Emp. Form.:
C17H27N3O4
Mol. Mass.:
337.414
SMILES:
COC(C)(C)C(=O)NC(CCCCN)C(=O)COc1cccnc1
: