Target
Cyclin-dependent kinase 9
Ligand
BDBM454548
Substrate
Meas. Tech.
Kinase Assay (ATP Concentration at Km)
IC50
<3.00±n/a nM
Citation
 Barlaam, BDe Savi, CHawkins, JHird, ALamb, MPike, KVasbinder, M Chemical compounds US Patent  US10717746 Publication Date 7/21/2020 
Target
Name:
Cyclin-dependent kinase 9
Synonyms:
C-2K CDK9 Cell division cycle 2-like protein kinase 4 Cyclin-Dependent Kinase 9 (CDK9) Serine/threonine-protein kinase PITALRE Tat-associated kinase complex catalytic subunit
Type:
Enzyme Subunit
Mol. Mass.:
42789.13
Organism:
Homo sapiens (Human)
Description:
Residue:
372
  
Inhibitor
Name:
BDBM454548
Synonyms:
US10717746, Example 31
Type:
Small organic molecule
Emp. Form.:
C22H25ClN6O2
Mol. Mass.:
440.926
SMILES:
Clc1cnc(NC(=O)[C@H]2CCC[C@H](C2)NC(=O)CC#N)cc1-c1cnn2CCCCc12
: