Target
Cyclin-dependent kinase 9
Ligand
BDBM454567
Substrate
Meas. Tech.
Kinase Assay (High ATP Concentration)
IC50
3.00±n/a nM
Citation
 Barlaam, BDe Savi, CHawkins, JHird, ALamb, MPike, KVasbinder, M Chemical compounds US Patent  US10717746 Publication Date 7/21/2020 
Target
Name:
Cyclin-dependent kinase 9
Synonyms:
C-2K CDK9 Cell division cycle 2-like protein kinase 4 Cyclin-Dependent Kinase 9 (CDK9) Serine/threonine-protein kinase PITALRE Tat-associated kinase complex catalytic subunit
Type:
Enzyme Subunit
Mol. Mass.:
42789.13
Organism:
Homo sapiens (Human)
Description:
Residue:
372
  
Inhibitor
Name:
BDBM454567
Synonyms:
US10717746, Example 48
Type:
Small organic molecule
Emp. Form.:
C21H26ClN5O2
Mol. Mass.:
415.916
SMILES:
CC(=O)N[C@@H]1CC[C@@H](C1)C(=O)Nc1cc(-c2cnn3CC(C)(C)Cc23)c(Cl)cn1
: