Target
Cyclin-dependent kinase 9
Ligand
BDBM454573
Substrate
Meas. Tech.
Kinase Assay (ATP Concentration at Km)
IC50
<3.00±n/a nM
Citation
 Barlaam, BDe Savi, CHawkins, JHird, ALamb, MPike, KVasbinder, M Chemical compounds US Patent  US10717746 Publication Date 7/21/2020 
Target
Name:
Cyclin-dependent kinase 9
Synonyms:
C-2K CDK9 Cell division cycle 2-like protein kinase 4 Cyclin-Dependent Kinase 9 (CDK9) Serine/threonine-protein kinase PITALRE Tat-associated kinase complex catalytic subunit
Type:
Enzyme Subunit
Mol. Mass.:
42789.13
Organism:
Homo sapiens (Human)
Description:
Residue:
372
  
Inhibitor
Name:
BDBM454573
Synonyms:
US10717746, Example 53
Type:
Small organic molecule
Emp. Form.:
C25H32ClN5O3
Mol. Mass.:
486.006
SMILES:
CC1(C)Cc2c(cnn2C1)-c1cc(NC(=O)[C@H]2CCC[C@H](C2)NC(=O)[C@@H]2C[C@H](O)C2)ncc1Cl
: