Target
Aquaporin-9
Ligand
BDBM454614
Substrate
Meas. Tech.
Calcein Quenching Fluostar Assay
EC50
455±n/a nM
Citation
 Evenas, JLarsson, JDreisch, K Compounds for modulating aquaporins US Patent  US10730865 Publication Date 8/4/2020 
Target
Name:
Aquaporin-9
Synonyms:
AQP-9 AQP9_HUMAN SSC1 | Small solute channel 1
Type:
Protein
Mol. Mass.:
31433.73
Organism:
Human
Description:
O43315
Residue:
295
  
Inhibitor
Name:
BDBM454614
Synonyms:
US10730865, Example 5
Type:
Small organic molecule
Emp. Form.:
C16H18N6O3S3
Mol. Mass.:
438.548
SMILES:
CCn1c(C)nnc1SCC(=O)Nc1nnc(s1)-c1ccc(cc1)S(C)(=O)=O
: