Target
Aquaporin-9
Ligand
BDBM454629
Substrate
Meas. Tech.
Calcein Quenching Fluostar Assay
EC50
79.0±n/a nM
Citation
 Evenas, JLarsson, JDreisch, K Compounds for modulating aquaporins US Patent  US10730865 Publication Date 8/4/2020 
Target
Name:
Aquaporin-9
Synonyms:
AQP-9 AQP9_HUMAN SSC1 | Small solute channel 1
Type:
Protein
Mol. Mass.:
31433.73
Organism:
Human
Description:
O43315
Residue:
295
  
Inhibitor
Name:
BDBM454629
Synonyms:
US10730865, Example 20
Type:
Small organic molecule
Emp. Form.:
C19H24N6OS2
Mol. Mass.:
416.563
SMILES:
CCc1nnc(SCC(=O)Nc2nnc(s2)-c2ccc(cc2)C(C)C)n1CC
: